BDBM235176 US9359348, 10
SMILES Cc1nc(C)n(n1)-c1cc(nc(C)n1)[C@@H]1C[C@H]1c1nc2ccccn2c1C=C
InChI Key InChIKey=ZOIBTENGDKOKRD-HZPDHXFCSA-N
Data  1 KI
  Tab Delimited (TSV)   2D SDfile   Computed 3D by Vconf -m prep SDfile
Find this compound or compounds like it in BindingDB:
Activity Spreadsheet -- Enzyme Inhibition Constant Data from BindingDB
Found 1 hit for monomerid = 235176
LigandPNGBDBM235176(US9359348, 10)
Affinity DataKi:  3.80nM ΔG°:  -11.5kcal/moleT: 2°C. Assay description: The fluorescence polarization assay for cyclic nucleotide phosphodiesterases was performed using an IMAP FP kit supplied by Molecular Devices, Sunnyv...
Ligand InfoPC cidPC sid
In DepthDetails US Patent