BDBM235230 US9365558, 53::US9822074, 53
SMILES CCn1ccc(n1)C1=C(C(=O)NS(=O)(=O)C2CC2)C(=O)N[C@@](C1)(c1ccc(CCCCC(F)(F)F)cc1F)C(F)(F)F
InChI Key InChIKey=CINTWDPONFQNAJ-DEOSSOPVSA-N
Data  2 IC50
  Tab Delimited (TSV)   2D SDfile   Computed 3D by Vconf -m prep SDfile
Find this compound or compounds like it in BindingDB:
Activity Spreadsheet -- Enzyme Inhibition Constant Data from BindingDB
Found 2 hits for monomerid = 235230
TargetAlpha-1,6-mannosyl-glycoprotein 2-beta-N-acetylglucosaminyltransferase(Homo sapiens (Human))
Bristol-Myers Squibb
US Patent
LigandPNGBDBM235230(US9365558, 53 | US9822074, 53)
Affinity DataIC50:  89nM. Assay description: The MGAT enzyme reactions were performed in Corning FALCONŽ 96-well Polypropylene plates, in a total volume of 60 μL of 50 mM Potassium Phosphat...
Ligand InfoPC cidPC sid
In DepthDetails US Patent
TargetAlpha-1,6-mannosyl-glycoprotein 2-beta-N-acetylglucosaminyltransferase(Homo sapiens (Human))
Bristol-Myers Squibb
US Patent
LigandPNGBDBM235230(US9365558, 53 | US9822074, 53)
Affinity DataIC50:  89nMpH: 7.4 T: 2°C. Assay description: The MGAT enzyme reactions were performed in Corning FALCON® 96-well Polypropylene plates, in a total volume of 60 μL of 50 mM Potassium Phosph...
Ligand InfoPC cidPC sid
In DepthDetails US Patent