BDBM235274 US9365558, 97::US9822074, 97
SMILES CCOc1ccc(cc1)C1=C(C(=O)NS(C)(=O)=O)C(=O)N[C@@](C1)(c1ccc(OCCCC(F)(F)F)cc1F)C(F)(F)F
InChI Key InChIKey=FKSIWRJLLLBHTA-DEOSSOPVSA-N
Data  2 IC50
  Tab Delimited (TSV)   2D SDfile   Computed 3D by Vconf -m prep SDfile
Find this compound or compounds like it in BindingDB:
Activity Spreadsheet -- Enzyme Inhibition Constant Data from BindingDB
Found 2 hits for monomerid = 235274
TargetAlpha-1,6-mannosyl-glycoprotein 2-beta-N-acetylglucosaminyltransferase(Homo sapiens (Human))
Bristol-Myers Squibb
US Patent
LigandPNGBDBM235274(US9365558, 97 | US9822074, 97)
Affinity DataIC50:  42nM. Assay description: The MGAT enzyme reactions were performed in Corning FALCONŽ 96-well Polypropylene plates, in a total volume of 60 μL of 50 mM Potassium Phosphat...
Ligand InfoPC cidPC sid
In DepthDetails US Patent
TargetAlpha-1,6-mannosyl-glycoprotein 2-beta-N-acetylglucosaminyltransferase(Homo sapiens (Human))
Bristol-Myers Squibb
US Patent
LigandPNGBDBM235274(US9365558, 97 | US9822074, 97)
Affinity DataIC50:  42nMpH: 7.4 T: 2°C. Assay description: The MGAT enzyme reactions were performed in Corning FALCON® 96-well Polypropylene plates, in a total volume of 60 μL of 50 mM Potassium Phosph...
Ligand InfoPC cidPC sid
In DepthDetails US Patent