BDBM235611 US9359338, Exe. 221
SMILES Fc1cc(Oc2ccnc(NC(=O)C3CC3)c2)ccc1NC(=O)Nc1ccc(C#N)c(Cl)c1
InChI Key InChIKey=PCIUPUJAEYWFRQ-UHFFFAOYSA-N
Data  2 IC50
  Tab Delimited (TSV)   2D SDfile   Computed 3D by Vconf -m prep SDfile
Find this compound or compounds like it in BindingDB:
Activity Spreadsheet -- Enzyme Inhibition Constant Data from BindingDB
Found 2 hits for monomerid = 235611
TargetSerine/threonine-protein kinase B-raf(Homo sapiens (Human))
Crown Bioscience Inc. (Taiwan)
US Patent
LigandPNGBDBM235611(US9359338, Exe. 221)
Affinity DataIC50:  11nMT: 2°C. Assay description: [Experimental method]: Use ADP-GLO™ assay kit from Promega to evaluate the inhibitory activity of compounds at B-Raf. [Instrument]: PerKinElmer...
Ligand InfoPC cidPC sid
In DepthDetails US Patent
TargetVascular endothelial growth factor receptor 2 [790-1356](Homo sapiens (Human))
Crown Bioscience Inc. (Taiwan)
US Patent
LigandPNGBDBM235611(US9359338, Exe. 221)
Affinity DataIC50:  6.70nMT: 2°C. Assay description: [Experimental method]: Use Lance@Ultra Ulight™-TK assay kit from PerKinElmer to evaluate the inhibitory activity of compounds at KDR kinase. [I...
Ligand InfoPC cidPC sid
In DepthDetails US Patent