BDBM235650 N1,N6-bis((7-methoxybenzo[d][1,3]dioxol-5-yl)methyl)hexane-1,6-diamine (5d)
SMILES COc1cc(CNCCCCCCNCc2cc3OCOc3c(OC)c2)cc2OCOc12
InChI Key InChIKey=TZMDWCJQVQRVMY-UHFFFAOYSA-N
Data  2 IC50
  Tab Delimited (TSV)   2D SDfile   Computed 3D by Vconf -m prep SDfile
Find this compound or compounds like it in BindingDB:
Activity Spreadsheet -- Enzyme Inhibition Constant Data from BindingDB
Found 2 hits for monomerid = 235650
TargetCholinesterase(Equus caballus (Horse))
Sun Yat-Sen University
LigandPNGBDBM235650(N1,N6-bis((7-methoxybenzo[d][1,3]dioxol-5-yl)methy...)
Affinity DataIC50:  2.07E+3nMpH: 8.0 T: 2°C. Assay description: All the assays were under 0.1 M KH2PO4/K2HPO4 buffer, pH 8.0, using a Shimadzu 2450 Spectrophotometer. Enzyme solutions were prepared to give 2.0 uni...
Ligand InfoPC cidPC sid
In DepthDetails ArticlePubMed
TargetAcetylcholinesterase(Electrophorus electricus (Electric eel))
Sun Yat-Sen University
LigandPNGBDBM235650(N1,N6-bis((7-methoxybenzo[d][1,3]dioxol-5-yl)methy...)
Affinity DataIC50:  9.78E+3nMpH: 8.0 T: 2°C. Assay description: All the assays were under 0.1 M KH2PO4/K2HPO4 buffer, pH 8.0, using a Shimadzu 2450 Spectrophotometer. Enzyme solutions were prepared to give 2.0 uni...
Ligand InfoPC cidPC sid
In DepthDetails ArticlePubMed