BDBM235686 hDDAH inhibitor, 1c
SMILES C\C=C\CC(=N)NCCC[C@H](N)C(O)=O
InChI Key InChIKey=JUSNBVJTFYDFKR-SGJFDWMWSA-N
Data  1 KI
  Tab Delimited (TSV)   2D SDfile   Computed 3D by Vconf -m prep SDfile
Find this compound or compounds like it in BindingDB:
Activity Spreadsheet -- Enzyme Inhibition Constant Data from BindingDB
Found 1 hit for monomerid = 235686
TargetN(G),N(G)-dimethylarginine dimethylaminohydrolase 1(Homo sapiens (Human))
Christian-Albrechts-University
LigandPNGBDBM235686(hDDAH inhibitor, 1c)
Affinity DataKi:  3.60E+4nM ΔG°:  -6.30kcal/molepH: 7.4 T: 2°C. Assay description: A colorimetric assay was carried out in 150 μL 50 mM potassium phosphate buffer pH 7.4 containing 4 μg of recombinant hDDAH-1 and varying c...
In DepthDetails ArticlePubMed