BDBM235691 hDDAH inhibitor, 2e
SMILES N[C@@H](CCCNC(=N)NCC#C)C(O)=O
InChI Key InChIKey=IAYULXZCALADJD-ZETCQYMHSA-N
Data  1 KI
  Tab Delimited (TSV)   2D SDfile   Computed 3D by Vconf -m prep SDfile
Find this compound or compounds like it in BindingDB:
Activity Spreadsheet -- Enzyme Inhibition Constant Data from BindingDB
Found 1 hit for monomerid = 235691
TargetN(G),N(G)-dimethylarginine dimethylaminohydrolase 1(Homo sapiens (Human))
Christian-Albrechts-University
LigandPNGBDBM235691(hDDAH inhibitor, 2e)
Affinity DataKi:  1.70E+4nM ΔG°:  -6.76kcal/molepH: 7.4 T: 2°C. Assay description: A colorimetric assay was carried out in 150 μL 50 mM potassium phosphate buffer pH 7.4 containing 4 μg of recombinant hDDAH-1 and varying c...
Ligand InfoPC cidPC sid
In DepthDetails ArticlePubMed