BDBM235713 US10117875, Example 1::US9359361, 1
SMILES CN1CCN(CC1)c1ccc(cc1)-c1nc(NCCN2CCOCC2)c2nccnc2n1
InChI Key InChIKey=XUOOFFAXKDDUNT-UHFFFAOYSA-N
Data  2 IC50
  Tab Delimited (TSV)   2D SDfile   Computed 3D by Vconf -m prep SDfile
Find this compound or compounds like it in BindingDB:
Activity Spreadsheet -- Enzyme Inhibition Constant Data from BindingDB
Found 2 hits for monomerid = 235713
TargetToll-like receptor 9(Homo sapiens (Human))
Janus Biotherapeutics
US Patent
LigandPNGBDBM235713(US10117875, Example 1 | US9359361, 1)
Affinity DataIC50:  285nM. Assay description: HEK-Blue-hTLR9 cells were obtained from InvivoGen Inc. and used to determine test compound antagonism of human TLR9 (hTLR9) driven responses. HEK-Blu...
Ligand InfoPC cidPC sid
In DepthDetails US Patent
TargetToll-like receptor 9(Homo sapiens (Human))
Janus Biotherapeutics
US Patent
LigandPNGBDBM235713(US10117875, Example 1 | US9359361, 1)
Affinity DataIC50:  285nMT: 2°C. Assay description: Day 1: A cell suspension of HEK-Blue™-hTLR9 cells at ~450,000 cells per ml in test medium which contained 5% (v/v) heat inactivated FBS was pre...
Ligand InfoPC cidPC sid
In DepthDetails US Patent