BDBM235870 US9364482, 45
SMILES CNC(=O)c1c(oc2cc(N(C)S(C)(=O)=O)c(cc12)-c1ccc2nnn([C@@H](C)c3ccc(F)cc3)c(=O)c2c1)-c1ccc(F)cc1
InChI Key InChIKey=DOEZXCZJNCFNGG-SFHVURJKSA-N
Data  2 IC50
  Tab Delimited (TSV)   2D SDfile   Computed 3D by Vconf -m prep SDfile
Find this compound or compounds like it in BindingDB:
Activity Spreadsheet -- Enzyme Inhibition Constant Data from BindingDB
Found 2 hits for monomerid = 235870
TargetGenome polyprotein [1027-1711](Hepatitis C virus genotype 1b (isolate BK) (HCV))
Merck Sharp & Dohme
US Patent
LigandPNGBDBM235870(US9364482, 45)
Affinity DataIC50:  17.5nM. Assay description: Stable neomycin phosphotransferase encoding replicons-harboring cell lines were used, so all cell lines were maintained under G418 selection prior to...
Ligand InfoPC cidPC sid
In DepthDetails US Patent
TargetGenome polyprotein [1027-1711](Hepatitis C virus genotype 1a (strain H77) (HCV))
Merck Sharp & Dohme
US Patent
LigandPNGBDBM235870(US9364482, 45)
Affinity DataIC50:  35.0nM. Assay description: Stable neomycin phosphotransferase encoding replicons-harboring cell lines were used, so all cell lines were maintained under G418 selection prior to...
Ligand InfoPC cidPC sid
In DepthDetails US Patent