BDBM235911 US9365502, MQ-54
SMILES C[C@@]12CC3CCC4C[C@H](O)CCC4C3CC1CC[C@]21CO1
InChI Key InChIKey=SNQUVMKPORCQAB-GKNSXQQPSA-N
Data  1 IC50
  Tab Delimited (TSV)   2D SDfile   Computed 3D by Vconf -m prep SDfile
Find this compound or compounds like it in BindingDB:
Activity Spreadsheet -- Enzyme Inhibition Constant Data from BindingDB
Found 1 hit for monomerid = 235911
TargetGamma-aminobutyric acid receptor subunit alpha-4(Rattus norvegicus (Rat))
Washington University
US Patent
LigandPNGBDBM235911(US9365502, MQ-54)
Affinity DataIC50:  1.99E+3nM. Assay description: The IC50 values for non-competitive displacers of [35S]-TBPS from the picrotoxin binding site on GABAA receptors.
Ligand InfoPC cidPC sid
In DepthDetails US Patent