BDBM235936 US9365534, HU-911
SMILES CCCCCCC(C)(C)c1cc(OC)c(C2=C[C@@H]3CC[C@@]2(C(=O)OC)C3(C)C)c(OC)c1
InChI Key InChIKey=LGQFOUYDVWEHMQ-HMILPKGGSA-N
Data  1 KI  1 IC50  1 EC50
  Tab Delimited (TSV)   2D SDfile   Computed 3D by Vconf -m prep SDfile
Find this compound or compounds like it in BindingDB:
Activity Spreadsheet -- Enzyme Inhibition Constant Data from BindingDB
Found 3 hits for monomerid = 235936
TargetCannabinoid receptor 2(Homo sapiens (Human))
Yissum Research Development Company Of The Hebrew University Of Jerusalem
US Patent
LigandPNGBDBM235936(US9365534, HU-911)
Affinity DataKi:  84.6nM ΔG°:  -9.80kcal/molepH: 7.4 T: 2°C. Assay description: The Kd of CP 55,940 in the isolated CB1 and CB2 receptor expressing membranes was previously determined to be 2.3 nM and 1.5 nM, respectively (see Pe...
Ligand InfoPC cidPC sid
In DepthDetails US Patent
TargetCannabinoid receptor 2(Homo sapiens (Human))
Yissum Research Development Company Of The Hebrew University Of Jerusalem
US Patent
LigandPNGBDBM235936(US9365534, HU-911)
Affinity DataEC50:  126nMpH: 7.5Assay Description:Human CB2 expressing CHO-K1 membranes (5 μg per incubation mixture) were diluted in 50 mM Tris-HCl (pH 7.5) and 0.5 mM EDTA and added to HU comp...
Ligand InfoPC cidPC sid
In DepthDetails US Patent
TargetCannabinoid receptor 2(Homo sapiens (Human))
Yissum Research Development Company Of The Hebrew University Of Jerusalem
US Patent
LigandPNGBDBM235936(US9365534, HU-911)
Affinity DataIC50:  385nMpH: 7.5 T: 2°C. Assay description: Cells were seeded at a density of 10,000 cells per well in poly-L-lysine treated 96-well culture plates (BD Biosciences). The following day wells wer...
Ligand InfoPC cidPC sid
In DepthDetails US Patent