BDBM235943 US9365534, HU-938
SMILES CCCCCc1cc(OC)c(C2C(O)[C@]3(C)CC[C@H]2C3(C)C)c(OC)c1
InChI Key InChIKey=QLWFTMSARKCILR-UWXZQQSTSA-N
Data  1 KI
  Tab Delimited (TSV)   2D SDfile   Computed 3D by Vconf -m prep SDfile
Find this compound or compounds like it in BindingDB:
Activity Spreadsheet -- Enzyme Inhibition Constant Data from BindingDB
Found 1 hit for monomerid = 235943
TargetCannabinoid receptor 2(Homo sapiens (Human))
Yissum Research Development Company Of The Hebrew University Of Jerusalem
US Patent
LigandPNGBDBM235943(US9365534, HU-938)
Affinity DataKi:  7.91E+3nM ΔG°:  -7.07kcal/molepH: 7.4 T: 2°C. Assay description: The Kd of CP 55,940 in the isolated CB1 and CB2 receptor expressing membranes was previously determined to be 2.3 nM and 1.5 nM, respectively (see Pe...
Ligand InfoPC cidPC sid
In DepthDetails US Patent