BDBM23596 (3-Phenoxybenzoylamino)benzoic acid deriv., 24e::2-{[4-(4-methylphenyl)-3-phenoxybenzene]amido}benzoic acid
SMILES Cc1ccc(cc1)-c1ccc(cc1Oc1ccccc1)C(=O)Nc1ccccc1C(O)=O
InChI Key InChIKey=BLHOGYDIPNYJHI-UHFFFAOYSA-N
Data  2 IC50
  Tab Delimited (TSV)   2D SDfile   Computed 3D by Vconf -m prep SDfile
Find this compound or compounds like it in BindingDB:
Activity Spreadsheet -- Enzyme Inhibition Constant Data from BindingDB
Found 2 hits for monomerid = 23596
Target3-oxoacyl-[acyl-carrier-protein] synthase 3(Enterococcus faecalis)
Shri G.S. Institute Of Technology And Science
Curated by ChEMBL
LigandPNGBDBM23596((3-Phenoxybenzoylamino)benzoic acid deriv., 24e | ...)
Affinity DataIC50:  160nM. Assay description: Inhibition of Enterococcus faecalis FabH by FabD/FabH coupled assay
In DepthDetails ArticlePubMed
Target3-oxoacyl-[acyl-carrier-protein] synthase 3(Enterococcus faecalis)
Shri G.S. Institute Of Technology And Science
Curated by ChEMBL
LigandPNGBDBM23596((3-Phenoxybenzoylamino)benzoic acid deriv., 24e | ...)
Affinity DataIC50:  160nM. Assay description: The potency of FabH inhibition (IC50) was determined using [3H]- or [14C]-radiolabeled substrates. This was accomplished at fixed concentrations of a...
In DepthDetails ArticlePubMed