BDBM236007 US9365562, 45
SMILES Cc1nc(C2CCCCC2)n(n1)-c1cc(nc(C)n1)N1CC(C1)c1nc2ccccc2n1C
InChI Key InChIKey=NSOJZFXPDYJGLR-UHFFFAOYSA-N
Data  1 KI
  Tab Delimited (TSV)   2D SDfile   Computed 3D by Vconf -m prep SDfile
Find this compound or compounds like it in BindingDB:
Activity Spreadsheet -- Enzyme Inhibition Constant Data from BindingDB
Found 1 hit for monomerid = 236007
LigandPNGBDBM236007(US9365562, 45)
Affinity DataKi:  2nM ΔG°:  -11.9kcal/molepH: 7.2 T: 2°C. Assay description: The fluorescence polarization assay for cyclic nucleotide phosphodiesterases was performed using an IMAP® FP kit supplied by Molecular Devices, S...
Ligand InfoPC cidPC sid
In DepthDetails US Patent