BDBM236223 US9365575, 1
SMILES Clc1ccc(cc1)C1CN=C2N(C1)C(=O)Nc1ccccc21
InChI Key InChIKey=SACOEJUNHGRMDV-UHFFFAOYSA-N
Data  1 IC50
  Tab Delimited (TSV)   2D SDfile   Computed 3D by Vconf -m prep SDfile
Find this compound or compounds like it in BindingDB:
Activity Spreadsheet -- Enzyme Inhibition Constant Data from BindingDB
Found 1 hit for monomerid = 236223
TargetVascular endothelial growth factor receptor 2(Homo sapiens (Human))
Allergan
US Patent
LigandPNGBDBM236223(US9365575, 1)
Affinity DataIC50: >1.00E+4nMpH: 7.4 T: 2°C. Assay description: Biochemical KDR kinase assays were performed in 96 well microtiter plates that were coated overnight with 75 μg/well of poly-Glu-Tyr (4:1) in 10 m...
Ligand InfoPC cidPC sid
In DepthDetails US Patent