BDBM236254 US9365576, 7
SMILES CNC(=O)c1ccc(OC)c(c1)-c1cc2C(=O)N([C@H](c2n1C(C)C)c1ccc(Cl)cc1C)c1cccc(Cl)c1F
InChI Key InChIKey=CJCXKFFSPDPEDJ-NDEPHWFRSA-N
Data  3 IC50
  Tab Delimited (TSV)   2D SDfile   Computed 3D by Vconf -m prep SDfile
Find this compound or compounds like it in BindingDB:
Activity Spreadsheet -- Enzyme Inhibition Constant Data from BindingDB
Found 3 hits for monomerid = 236254
LigandPNGBDBM236254(US9365576, 7)
Affinity DataIC50:  0.600nMT: 2°C. Assay description: Assay 1: The test is performed in white 384-well plates (Greiner Bio-One, reference 781207) in a total volume of 60 μL by adding 1 μL of compou...
Ligand InfoPC cidPC sid
In DepthDetails US Patent
LigandPNGBDBM236254(US9365576, 7)
Affinity DataIC50:  0.119nMT: 2°C. Assay description: Assay 2: The test is performed in white 384-well plates (Greiner Bio-One, reference 781207) in a total volume of 60 μL by adding 1 μL of compou...
Ligand InfoPC cidPC sid
In DepthDetails US Patent
TargetCellular tumor antigen p53 [18-26]/Protein Mdm4 [2-185](Homo sapiens (Human))
Novartis
US Patent
LigandPNGBDBM236254(US9365576, 7)
Affinity DataIC50:  508nMT: 2°C. Assay description: Assay 1: The test is performed in white 384-well plates (Greiner Bio-One, reference 781207) in a total volume of 60 μL by adding 1 μL of compou...
Ligand InfoPC cidPC sid
In DepthDetails US Patent