BDBM236501 US9388137, 5
SMILES Cc1cc(cc(n1)-c1ccc(Oc2ccc(F)cc2)cc1)C(=O)NCC[N+]1(C)CCCC1
InChI Key InChIKey=OXDWPKWWDHUAOO-UHFFFAOYSA-O
Data  1 IC50
  Tab Delimited (TSV)   2D SDfile   Computed 3D by Vconf -m prep SDfile
Find this compound or compounds like it in BindingDB:
Activity Spreadsheet -- Enzyme Inhibition Constant Data from BindingDB
Found 1 hit for monomerid = 236501
TargetSodium channel protein type 9 subunit alpha(Homo sapiens (Human))
Purdue Pharma
US Patent
LigandPNGBDBM236501(US9388137, 5)
Affinity DataIC50:  2.90E+3nMpH: 7.3Assay Description:The assay buffer was formulated by removing 120 mL from a 1 L bottle of fresh, sterile dH2O (Mediatech, Herndon, Va.) and adding 100 mL of 10× HBSS t...
Ligand InfoPC cidPC sid
In DepthDetails US Patent