BDBM236586 US9365589, 1m
SMILES COCC(=O)Nc1ccc(F)c(c1)[C@]12COC[C@H]1S(=O)(=O)C(C)(C)C(=N)N2
InChI Key InChIKey=ODFHWGXAJALDTE-CXAGYDPISA-N
Data  2 KI
  Tab Delimited (TSV)   2D SDfile   Computed 3D by Vconf -m prep SDfile
Find this compound or compounds like it in BindingDB:
Activity Spreadsheet -- Enzyme Inhibition Constant Data from BindingDB
Found 2 hits for monomerid = 236586
TargetBeta-secretase 2(Homo sapiens (Human))
Merck Sharp & Dohme
US Patent
LigandPNGBDBM236586(US9365589, 1m)
Affinity DataKi:  5nMpH: 5.0Assay Description:Inhibitor IC50s at purified human autoBACE-2 are determined in a time-resolved endpoint proteolysis assay that measures hydrolysis of the QSY7-EISEVN...
Ligand InfoPC cidPC sid
In DepthDetails US Patent
TargetBeta-secretase 1(Homo sapiens (Human))
Merck Sharp & Dohme
US Patent
LigandPNGBDBM236586(US9365589, 1m)
Affinity DataKi:  74nM ΔG°:  -9.88kcal/molepH: 5.0 T: 2°C. Assay description: This assay monitors the increase of 620 nm fluorescence that resulted from BACE1 cleavage of an APPswedish APPswe mutant peptide FRET substrate (QSY7...
Ligand InfoPC cidPC sid
In DepthDetails US Patent