BDBM236742 US9388140, 86
SMILES CNC(=O)c1ccc(cc1C)-n1cnc2c(NCC3CCOCC3)cc(Oc3ccc(OC)cc3F)cc12
InChI Key InChIKey=HZQGRBPVTLTDRW-UHFFFAOYSA-N
Data  1 IC50
  Tab Delimited (TSV)   2D SDfile   Computed 3D by Vconf -m prep SDfile
Find this compound or compounds like it in BindingDB:
Activity Spreadsheet -- Enzyme Inhibition Constant Data from BindingDB
Found 1 hit for monomerid = 236742
TargetDual specificity protein kinase TTK(Homo sapiens (Human))
Bayer Intellectual Property
US Patent
LigandPNGBDBM236742(US9388140, 86)
Affinity DataIC50:  7nMpH: 7.7 T: 2°C. Assay description: For the assay 50 nL of a 100-fold concentrated solution of the test compound in DMSO was pipetted into a black low volume 384 well microtiter plate (...
Ligand InfoPC cidPC sid
In DepthDetails US Patent