BDBM236762 US9388140, 107
SMILES Cc1ccc(F)cc1Oc1cc(NCCC(F)(F)F)c2ncn(-c3ccc(C(=O)NC4CC4)c(C)c3)c2c1
InChI Key InChIKey=ZCTWUZWMTWCARY-UHFFFAOYSA-N
Data  1 IC50
  Tab Delimited (TSV)   2D SDfile   Computed 3D by Vconf -m prep SDfile
Find this compound or compounds like it in BindingDB:
Activity Spreadsheet -- Enzyme Inhibition Constant Data from BindingDB
Found 1 hit for monomerid = 236762
TargetDual specificity protein kinase TTK(Homo sapiens (Human))
Bayer Intellectual Property
US Patent
LigandPNGBDBM236762(US9388140, 107)
Affinity DataIC50:  5.30nMpH: 7.7 T: 2°C. Assay description: For the assay 50 nL of a 100-fold concentrated solution of the test compound in DMSO was pipetted into a black low volume 384 well microtiter plate (...
Ligand InfoPC cidPC sid
In DepthDetails US Patent