BDBM236817 US9388162, 1
SMILES CCOC(=O)C[C@H]1C[C@@]2(O)[C@H]3Cc4ccc(OC)cc4[C@@]2(CCN3CC2CC2)CC1=O
InChI Key InChIKey=BLZWGGQJDWDCCU-VCRBZLFYSA-N
Data  1 KI  2 EC50
  Tab Delimited (TSV)   2D SDfile   Computed 3D by Vconf -m prep SDfile
Find this compound or compounds like it in BindingDB:
Activity Spreadsheet -- Enzyme Inhibition Constant Data from BindingDB
Found 3 hits for monomerid = 236817
TargetKappa-type opioid receptor(Homo sapiens (Human))
Purdue Pharma
US Patent
LigandPNGBDBM236817(US9388162, 1)
Affinity DataKi:  408nM ΔG°:  -8.71kcal/molepH: 7.4 T: 2°C. Assay description: Radioligand dose displacement assays used 0.4 nM [3H]-U69,593 (GE Healthcare, Piscataway, N.J.; 40 Ci/mmole) with 15 μg membrane protein (recombin...
Ligand InfoPC cidPC sid
In DepthDetails US Patent
TargetKappa-type opioid receptor(Homo sapiens (Human))
Purdue Pharma
US Patent
LigandPNGBDBM236817(US9388162, 1)
Affinity DataEC50:  5.11E+3nMpH: 7.4 T: 2°C. Assay description: Functional [35S]GTPγS binding assays were conducted as follows. κ opioid receptor membrane solution was prepared by sequentially adding f...
Ligand InfoPC cidPC sid
In DepthDetails US Patent
TargetMu-type opioid receptor(Homo sapiens (Human))
Purdue Pharma
US Patent
LigandPNGBDBM236817(US9388162, 1)
Affinity DataEC50:  3.40E+3nMpH: 7.4 T: 2°C. Assay description: [35S]GTPγS functional assays were conducted using freshly thawed μ-receptor membranes prepared from a cell line expressing recombinant μ ...
Ligand InfoPC cidPC sid
In DepthDetails US Patent