BDBM236824 US9388162, 16
SMILES COc1ccc2C[C@H]3N(CC4CC4)CC[C@@]4(CC(=O)[C@@H](CC(=O)N5CCC[C@H]5C(O)=O)C[C@@]34O)c2c1
InChI Key InChIKey=YGROLQWQPPNSSD-BWRUTCSNSA-N
Data  1 KI  1 EC50
  Tab Delimited (TSV)   2D SDfile   Computed 3D by Vconf -m prep SDfile
Find this compound or compounds like it in BindingDB:
Activity Spreadsheet -- Enzyme Inhibition Constant Data from BindingDB
Found 2 hits for monomerid = 236824
TargetKappa-type opioid receptor(Homo sapiens (Human))
Purdue Pharma
US Patent
LigandPNGBDBM236824(US9388162, 16)
Affinity DataKi: >2.00E+4nM ΔG°: >-6.41kcal/molepH: 7.4 T: 2°C. Assay description: Radioligand dose displacement assays used 0.4 nM [3H]-U69,593 (GE Healthcare, Piscataway, N.J.; 40 Ci/mmole) with 15 μg membrane protein (recombin...
Ligand InfoPC cidPC sid
In DepthDetails US Patent
TargetMu-type opioid receptor(Homo sapiens (Human))
Purdue Pharma
US Patent
LigandPNGBDBM236824(US9388162, 16)
Affinity DataEC50:  6.77E+3nMpH: 7.4 T: 2°C. Assay description: [35S]GTPγS functional assays were conducted using freshly thawed μ-receptor membranes prepared from a cell line expressing recombinant μ ...
Ligand InfoPC cidPC sid
In DepthDetails US Patent