BDBM236845 US9388162, 30
SMILES CC(C)CCC(=O)N[C@H]1C[C@@]2(O)[C@H]3Cc4ccc(O)cc4[C@@]2(CCN3CC2CC2)CC1=O
InChI Key InChIKey=NSJXQNTZZXTVKQ-BKRIMNEDSA-N
Data  2 EC50
  Tab Delimited (TSV)   2D SDfile   Computed 3D by Vconf -m prep SDfile
Find this compound or compounds like it in BindingDB:
Activity Spreadsheet -- Enzyme Inhibition Constant Data from BindingDB
Found 2 hits for monomerid = 236845
TargetKappa-type opioid receptor(Homo sapiens (Human))
Purdue Pharma
US Patent
LigandPNGBDBM236845(US9388162, 30)
Affinity DataEC50:  1.61nMpH: 7.4 T: 2°C. Assay description: Functional [35S]GTPγS binding assays were conducted as follows. κ opioid receptor membrane solution was prepared by sequentially adding f...
Ligand InfoPC cidPC sid
In DepthDetails US Patent
TargetMu-type opioid receptor(Homo sapiens (Human))
Purdue Pharma
US Patent
LigandPNGBDBM236845(US9388162, 30)
Affinity DataEC50:  9.61nMpH: 7.4 T: 2°C. Assay description: [35S]GTPγS functional assays were conducted using freshly thawed μ-receptor membranes prepared from a cell line expressing recombinant μ ...
Ligand InfoPC cidPC sid
In DepthDetails US Patent