BDBM236855 US9388162, 43
SMILES Oc1ccc2C[C@H]3N(CC4CC4)CC[C@@]4(CC(=O)[C@H](C[C@@]34O)NS(=O)(=O)c3ccccc3)c2c1
InChI Key InChIKey=BFUJTOAMYBRTLE-DZWGLGNASA-N
Data  1 EC50
  Tab Delimited (TSV)   2D SDfile   Computed 3D by Vconf -m prep SDfile
Find this compound or compounds like it in BindingDB:
Activity Spreadsheet -- Enzyme Inhibition Constant Data from BindingDB
Found 1 hit for monomerid = 236855
TargetMu-type opioid receptor(Homo sapiens (Human))
Purdue Pharma
US Patent
LigandPNGBDBM236855(US9388162, 43)
Affinity DataEC50: >2.00E+5nMpH: 7.4 T: 2°C. Assay description: [35S]GTPγS functional assays were conducted using freshly thawed μ-receptor membranes prepared from a cell line expressing recombinant μ ...
Ligand InfoPC cidPC sid
In DepthDetails US Patent