BDBM236892 US9388176, 110
SMILES CSc1ncc2CN(CCc2n1)c1cccc(n1)C(=O)Nc1cccc(c1)C(C)C
InChI Key InChIKey=GAUIONVHTSPHFY-UHFFFAOYSA-N
Data  1 IC50
  Tab Delimited (TSV)   2D SDfile   Computed 3D by Vconf -m prep SDfile
Find this compound or compounds like it in BindingDB:
Activity Spreadsheet -- Enzyme Inhibition Constant Data from BindingDB
Found 1 hit for monomerid = 236892
TargetVascular endothelial growth factor receptor 2(Homo sapiens (Human))
Allergan
US Patent
LigandPNGBDBM236892(US9388176, 110)
Affinity DataIC50: >1.00E+4nMpH: 7.4 T: 2°C. Assay description: Biochemical KDR kinase assays were performed in 96 well microliter plates that were coated overnight with 75 μg/well of poly-Glu-Tyr (4:1) in 10 m...
Ligand InfoPC cidPC sid
In DepthDetails US Patent