BDBM236997 US9388189, 225
SMILES C[C@H](Nc1ncnc2[nH]cc(-c3ccnc(c3)N3CCC(CC3)N(C)C)c12)c1nn2ccc(C)c2c(=O)n1-c1ccccc1
InChI Key InChIKey=HJMRXGYYDQSQCR-QFIPXVFZSA-N
Data  1 IC50
  Tab Delimited (TSV)   2D SDfile   Computed 3D by Vconf -m prep SDfile
Find this compound or compounds like it in BindingDB:
Activity Spreadsheet -- Enzyme Inhibition Constant Data from BindingDB
Found 1 hit for monomerid = 236997
LigandPNGBDBM236997(US9388189, 225)
Affinity DataIC50:  0.400nM. Assay description: PI-3 Kinase HTRF kit (ref. #33-037) and the different PI3K recombinant isoforms (ref. #14-602, ref. #14-603, ref. #14-604, ref. #15-558 for Alpha, Be...
Ligand InfoPC cidPC sid
In DepthDetails US Patent