BDBM237060 US9388197, 62
SMILES Cc1cc(Cl)cc(Cl)c1CNC(=O)C1CCCc2ncsc12
InChI Key InChIKey=AEOVLTONKPMGPS-UHFFFAOYSA-N
Data  1 IC50
  Tab Delimited (TSV)   2D SDfile   Computed 3D by Vconf -m prep SDfile
Find this compound or compounds like it in BindingDB:
Activity Spreadsheet -- Enzyme Inhibition Constant Data from BindingDB
Found 1 hit for monomerid = 237060
TargetP2X purinoceptor 7(Homo sapiens (Human))
Actelion Pharmaceuticals
US Patent
LigandPNGBDBM237060(US9388197, 62)
Affinity DataIC50:  1.90nMT: 2°C. Assay description: Cells were grown to confluency in adherent culture at 37° C. in a humidified 5% CO2 incubator (split 1/5 every 3-4 days with DMEM, 10% FCS, 1% Pe...
Ligand InfoPC cidPC sid
In DepthDetails US Patent