BDBM237142 US9394304, 4
SMILES CC(C)(C)Nc1c(nc2ccc(cn12)C(F)(F)F)-c1cccc(F)c1
InChI Key InChIKey=GMHGSZNLCIEWAB-UHFFFAOYSA-N
Data  1 IC50
  Tab Delimited (TSV)   2D SDfile   Computed 3D by Vconf -m prep SDfile
Find this compound or compounds like it in BindingDB:
Activity Spreadsheet -- Enzyme Inhibition Constant Data from BindingDB
Found 1 hit for monomerid = 237142
TargetTransient receptor potential cation channel subfamily A member 1(Homo sapiens (Human))
Hoffmann-La Roche
US Patent
LigandPNGBDBM237142(US9394304, 4)
Affinity DataIC50:  1.33E+3nMT: 2°C. Assay description: Harvested cells with 0.025% trypsin/EDTA. Resuspended cells in growth media without selection antibiotics. Measured cell density and diluted to 2.4&t...
Ligand InfoPC cidPC sid
In DepthDetails US Patent