BDBM237185 Rutin butyrate
SMILES CCCC(=O)OC1C(C)OC(OCC2OC(Oc3c(oc4cc(O)cc(O)c4c3=O)-c3ccc(O)c(O)c3)C(O)C(O)C2O)C(O)C1O
InChI Key InChIKey=RBXHEVDSMSYORP-UHFFFAOYSA-N
Data  4 IC50
  Tab Delimited (TSV)   2D SDfile   Computed 3D by Vconf -m prep SDfile
Find this compound or compounds like it in BindingDB:
Activity Spreadsheet -- Enzyme Inhibition Constant Data from BindingDB
Found 4 hits for monomerid = 237185
TargetSerine protease 1(Bos taurus (bovine))
Slovak University Of Technology
LigandPNGBDBM237185(Rutin butyrate)
Affinity DataIC50: >5.00E+5nMpH: 8.0Assay Description:The rate of hydrolysis of the substrates (0.3 mM) by trypsin (18 U/ml), thrombin (12.5 NIH U/ml), urokinase (62500 IU/ml) and elastase (8.4 U/ml) was...
Ligand InfoPC cidPC sid
In DepthDetails ArticlePubMed
TargetChymotrypsin-like elastase family member 1(Sus scrofa (Pig))
Slovak University Of Technology
LigandPNGBDBM237185(Rutin butyrate)
Affinity DataIC50: >5.00E+5nMpH: 8.0Assay Description:The rate of hydrolysis of the substrates (0.3 mM) by trypsin (18 U/ml), thrombin (12.5 NIH U/ml), urokinase (62500 IU/ml) and elastase (8.4 U/ml) was...
Ligand InfoPC cidPC sid
In DepthDetails ArticlePubMed
TargetUrokinase-type plasminogen activator(Homo sapiens (Human))
Slovak University Of Technology
LigandPNGBDBM237185(Rutin butyrate)
Affinity DataIC50:  8.00E+3nMpH: 8.0Assay Description:The rate of hydrolysis of the substrates (0.3 mM) by trypsin (18 U/ml), thrombin (12.5 NIH U/ml), urokinase (62500 IU/ml) and elastase (8.4 U/ml) was...
Ligand InfoPC cidPC sid
In DepthDetails ArticlePubMed
TargetProthrombin(Bos taurus (Bovine))
Slovak University Of Technology
LigandPNGBDBM237185(Rutin butyrate)
Affinity DataIC50:  2.20E+4nMpH: 8.0Assay Description:The rate of hydrolysis of the substrates (0.3 mM) by trypsin (18 U/ml), thrombin (12.5 NIH U/ml), urokinase (62500 IU/ml) and elastase (8.4 U/ml) was...
Ligand InfoPC cidPC sid
In DepthDetails ArticlePubMed