BDBM237198 Phloridzin
SMILES OCC1OC(Oc2cc(O)cc(O)c2C(=O)CCc2ccc(O)cc2)C(O)C(O)C1O
InChI Key InChIKey=IOUVKUPGCMBWBT-UHFFFAOYSA-N
Data  4 IC50
PDB links: 1 PDB ID matches this monomer.
  Tab Delimited (TSV)   2D SDfile   Computed 3D by Vconf -m prep SDfile
Find this compound or compounds like it in BindingDB:
Activity Spreadsheet -- Enzyme Inhibition Constant Data from BindingDB
Found 4 hits for monomerid = 237198
TargetSerine protease 1(Bos taurus (bovine))
Slovak University Of Technology
LigandPNGBDBM237198(Phloridzin)
Affinity DataIC50:  9.00E+4nMpH: 8.0Assay Description:The rate of hydrolysis of the substrates (0.3 mM) by trypsin (18 U/ml), thrombin (12.5 NIH U/ml), urokinase (62500 IU/ml) and elastase (8.4 U/ml) was...
In DepthDetails ArticlePubMed
TargetChymotrypsin-like elastase family member 1(Sus scrofa (Pig))
Slovak University Of Technology
LigandPNGBDBM237198(Phloridzin)
Affinity DataIC50:  1.00E+5nMpH: 8.0Assay Description:The rate of hydrolysis of the substrates (0.3 mM) by trypsin (18 U/ml), thrombin (12.5 NIH U/ml), urokinase (62500 IU/ml) and elastase (8.4 U/ml) was...
In DepthDetails ArticlePubMed
TargetUrokinase-type plasminogen activator(Homo sapiens (Human))
Slovak University Of Technology
LigandPNGBDBM237198(Phloridzin)
Affinity DataIC50:  8.00E+4nMpH: 8.0Assay Description:The rate of hydrolysis of the substrates (0.3 mM) by trypsin (18 U/ml), thrombin (12.5 NIH U/ml), urokinase (62500 IU/ml) and elastase (8.4 U/ml) was...
In DepthDetails ArticlePubMed
TargetProthrombin(Bos taurus (Bovine))
Slovak University Of Technology
LigandPNGBDBM237198(Phloridzin)
Affinity DataIC50:  3.20E+5nMpH: 8.0Assay Description:The rate of hydrolysis of the substrates (0.3 mM) by trypsin (18 U/ml), thrombin (12.5 NIH U/ml), urokinase (62500 IU/ml) and elastase (8.4 U/ml) was...
In DepthDetails ArticlePubMed