BDBM23722 4-chloro-1-[(4-chlorophenyl)carbonyl]-3,5-dimethyl-1H-pyrazole::N-Benzoylpyrazole deriv., 30
SMILES Cc1nn(C(=O)c2ccc(Cl)cc2)c(C)c1Cl
InChI Key InChIKey=NTPKEXXMJVFTKE-UHFFFAOYSA-N
Data  1 KI  6 IC50
  Tab Delimited (TSV)   2D SDfile   Computed 3D by Vconf -m prep SDfile
Find this compound or compounds like it in BindingDB:
Activity Spreadsheet -- Enzyme Inhibition Constant Data from BindingDB
Found 12 hits for monomerid = 23722
TargetNeutrophil elastase(Homo sapiens (Human))
Montana State University
LigandPNGBDBM23722(4-chloro-1-[(4-chlorophenyl)carbonyl]-3,5-dimethyl...)
Affinity DataKi:  1.07E+4nM ΔG°:  -6.78kcal/molepH: 7.5 T: 2°C. Assay description: HTS was performed in black flat-bottom 96-well microtiter plates. The reaction was initiated by addition of elastase substrate to the reaction buffer...
In DepthDetails ArticlePubMed
TargetProthrombin(Homo sapiens (Human))
Montana State University
LigandPNGBDBM23722(4-chloro-1-[(4-chlorophenyl)carbonyl]-3,5-dimethyl...)
Affinity Data. Assay description: Thrombin activity was monitored at excitation and emission wavelengths of 355 and 460 nm, respectively. For all compounds tested, the concentration o...
In DepthDetails ArticlePubMed
TargetUrokinase-type plasminogen activator(Homo sapiens (Human))
Montana State University
LigandPNGBDBM23722(4-chloro-1-[(4-chlorophenyl)carbonyl]-3,5-dimethyl...)
Affinity Data. Assay description: Urokinase activity was monitored at excitation and emission wavelengths of 355 and 460 nm, respectively. For all compounds tested, the concentration ...
In DepthDetails ArticlePubMed
TargetPlasma kallikrein(Homo sapiens (Human))
Montana State University
LigandPNGBDBM23722(4-chloro-1-[(4-chlorophenyl)carbonyl]-3,5-dimethyl...)
Affinity Data. Assay description: Kallikrein activity was monitored at excitation and emission wavelengths of 355 and 460 nm, respectively. For all compounds tested, the concentration...
In DepthDetails ArticlePubMed
TargetE3 ubiquitin-protein ligase XIAP(Homo sapiens (Human))
Quaid-I-Azam University
Curated by ChEMBL
LigandPNGBDBM23722(4-chloro-1-[(4-chlorophenyl)carbonyl]-3,5-dimethyl...)
Affinity DataIC50:  1.28E+4nM. Assay description: Inhibition of human IAP expressed in COS7 cells using CDP-star as substrate preincubated for 5 to 10 mins followed by substrate addition measured aft...
In DepthDetails ArticlePubMed
TargetCathepsin D(Homo sapiens (Human))
Montana State University
LigandPNGBDBM23722(4-chloro-1-[(4-chlorophenyl)carbonyl]-3,5-dimethyl...)
Affinity Data. Assay description: Cathepsin D assays were monitored with a Fluoroskan Ascent FL microtiter plate reader at excitation and emission wavelengths of 340 and 390 nm, respe...
In DepthDetails ArticlePubMed
TargetEctonucleoside triphosphate diphosphohydrolase 1(Rattus norvegicus)
Quaid-I-Azam University
Curated by ChEMBL
LigandPNGBDBM23722(4-chloro-1-[(4-chlorophenyl)carbonyl]-3,5-dimethyl...)
Affinity DataIC50:  2.24E+4nM. Assay description: Inhibition of rat NTPDase1 expressed in CHO cells using ATP as substrate preincubated for 10 mins followed by substrate addition measured after 10 mi...
In DepthDetails ArticlePubMed
TargetEctonucleotide pyrophosphatase/phosphodiesterase family member 3(Homo sapiens (Human))
Quaid-I-Azam University
Curated by ChEMBL
LigandPNGBDBM23722(4-chloro-1-[(4-chlorophenyl)carbonyl]-3,5-dimethyl...)
Affinity DataIC50:  630nM. Assay description: Inhibition of human NPP3 expressed in COS7 cells using p-nitrophenyl-5'-thymidine monophosphate as substrate preincubated for 5 to 10 mins followed b...
In DepthDetails ArticlePubMed
TargetAlkaline phosphatase, tissue-nonspecific isozyme(Homo sapiens (Human))
Quaid-I-Azam University
Curated by ChEMBL
LigandPNGBDBM23722(4-chloro-1-[(4-chlorophenyl)carbonyl]-3,5-dimethyl...)
Affinity DataIC50:  910nM. Assay description: Inhibition of human TNAP expressed in COS7 cells using CDP-star as substrate preincubated for 5 to 10 mins followed by substrate addition measured af...
In DepthDetails ArticlePubMed
TargetEctonucleotide pyrophosphatase/phosphodiesterase family member 1(Homo sapiens (Human))
Quaid-I-Azam University
Curated by ChEMBL
LigandPNGBDBM23722(4-chloro-1-[(4-chlorophenyl)carbonyl]-3,5-dimethyl...)
Affinity DataIC50:  5.34E+3nM. Assay description: Inhibition of human NPP1 expressed in COS7 cells using p-nitrophenyl-5'-thymidine monophosphate as substrate preincubated for 5 to 10 mins followed b...
In DepthDetails ArticlePubMed
TargetChymotrypsin-C(Homo sapiens (Human))
Montana State University
LigandPNGBDBM23722(4-chloro-1-[(4-chlorophenyl)carbonyl]-3,5-dimethyl...)
Affinity DataIC50:  4.70E+3nM. Assay description: Chymotrypsin activity was monitored at excitation and emission wavelengths of 355 and 460 nm, respectively. For all compounds tested, the concentrati...
In DepthDetails ArticlePubMed
TargetAminopeptidase N(Sus scrofa (Pig))
Montana State University
LigandPNGBDBM23722(4-chloro-1-[(4-chlorophenyl)carbonyl]-3,5-dimethyl...)
Affinity Data. Assay description: Reactions for aminopeptidase M activity were monitored at 405 nm using a SpectraMax Plus microplate reader. For all compounds tested, the concentrati...
In DepthDetails ArticlePubMed