BDBM237232 hCA inhibitor, 3
SMILES CCOC1Oc2c(Br)cccc2C(=O)\C1=C/Nc1ccc(cc1)S(N)(=O)=O
InChI Key InChIKey=JKEJCSCIDRJJIR-GXDHUFHOSA-N
Data  3 KI
  Tab Delimited (TSV)   2D SDfile   Computed 3D by Vconf -m prep SDfile
Find this compound or compounds like it in BindingDB:
Activity Spreadsheet -- Enzyme Inhibition Constant Data from BindingDB
Found 3 hits for monomerid = 237232
TargetCarbonic anhydrase 2(Homo sapiens (Human))
Ondokuz Mayis University
LigandPNGBDBM237232(hCA inhibitor, 3)
Affinity DataKi:  1.13E+3nM ΔG°:  -8.11kcal/molepH: 7.4 T: 2°C. Assay description: Carbonic anhydrase activity was assayed by following the change in absorbance at 348 nm of 4-nitrophenylacetate (NPA) to 4-nitrophenylate ion over a ...
Ligand InfoPC cidPC sid
In DepthDetails ArticlePubMed
TargetCarbonic anhydrase 6(Homo sapiens (Human))
Ondokuz Mayis University
LigandPNGBDBM237232(hCA inhibitor, 3)
Affinity DataKi:  2.24E+3nM ΔG°:  -7.70kcal/molepH: 7.4 T: 2°C. Assay description: Carbonic anhydrase activity was assayed by following the change in absorbance at 348 nm of 4-nitrophenylacetate (NPA) to 4-nitrophenylate ion over a ...
Ligand InfoPC cidPC sid
In DepthDetails ArticlePubMed
TargetCarbonic anhydrase 1(Homo sapiens (Human))
Ondokuz Mayis University
LigandPNGBDBM237232(hCA inhibitor, 3)
Affinity DataKi:  4.81E+4nM ΔG°:  -5.89kcal/molepH: 7.4 T: 2°C. Assay description: Carbonic anhydrase activity was assayed by following the change in absorbance at 348 nm of 4-nitrophenylacetate (NPA) to 4-nitrophenylate ion over a ...
Ligand InfoPC cidPC sid
In DepthDetails ArticlePubMed