BDBM237492 US9393232, 3.9
SMILES Cc1noc(C)c1-c1ccc2NC(=O)C(CCCN3CCC(O)CC3)(c2c1)c1ccccc1
InChI Key InChIKey=ORTGZXFYFUAESO-UHFFFAOYSA-N
Data  1 IC50
  Tab Delimited (TSV)   2D SDfile   Computed 3D by Vconf -m prep SDfile
Find this compound or compounds like it in BindingDB:
Activity Spreadsheet -- Enzyme Inhibition Constant Data from BindingDB
Found 1 hit for monomerid = 237492
TargetBromodomain-containing protein 4 [1-477](Homo sapiens (Human))
Beigene
US Patent
LigandPNGBDBM237492(US9393232, 3.9)
Affinity DataIC50:  120nMpH: 7.5Assay Description:The assay was carried out in binding mixtures of the bromodomain protein, 0-10 μM compounds and tetra-acetylated histone peptide (SGRGAC.KGGAC.K...
Ligand InfoPC cidPC sid
In DepthDetails US Patent