BDBM237513 US9393232, 2.12b
SMILES CC(C)[C@@H](CO)NC1(C(=O)Nc2ccc(cc12)-c1c(C)noc1C)c1ccccc1
InChI Key InChIKey=HUSZVVFPYFRMAR-CILPGNKCSA-N
Data  1 IC50
  Tab Delimited (TSV)   2D SDfile   Computed 3D by Vconf -m prep SDfile
Find this compound or compounds like it in BindingDB:
Activity Spreadsheet -- Enzyme Inhibition Constant Data from BindingDB
Found 1 hit for monomerid = 237513
TargetBromodomain-containing protein 4 [1-477](Homo sapiens (Human))
Beigene
US Patent
LigandPNGBDBM237513(US9393232, 2.12b)
Affinity DataIC50:  3.40E+3nMpH: 7.5Assay Description:The assay was carried out in binding mixtures of the bromodomain protein, 0-10 μM compounds and tetra-acetylated histone peptide (SGRGAC.KGGAC.K...
Ligand InfoPC cidPC sid
In DepthDetails US Patent