BDBM237519 US9393232, 2.20a::US9393232, 2.20b
SMILES CC(C)[C@H](CO)NC1(C2CCCCC2)C(=O)Nc2ccc(cc12)-c1c(C)noc1C
InChI Key InChIKey=JCAGILJXSOSSRZ-XEGCMXMBSA-N
Data  2 IC50
  Tab Delimited (TSV)   2D SDfile   Computed 3D by Vconf -m prep SDfile
Find this compound or compounds like it in BindingDB:
Activity Spreadsheet -- Enzyme Inhibition Constant Data from BindingDB
Found 2 hits for monomerid = 237519
TargetBromodomain-containing protein 4 [1-477](Homo sapiens (Human))
Beigene
US Patent
LigandPNGBDBM237519(US9393232, 2.20a | US9393232, 2.20b)
Affinity DataIC50:  350nMpH: 7.5Assay Description:The assay was carried out in binding mixtures of the bromodomain protein, 0-10 μM compounds and tetra-acetylated histone peptide (SGRGAC.KGGAC.K...
Ligand InfoPC cidPC sid
In DepthDetails US Patent
TargetBromodomain-containing protein 4 [1-477](Homo sapiens (Human))
Beigene
US Patent
LigandPNGBDBM237519(US9393232, 2.20a | US9393232, 2.20b)
Affinity DataIC50:  5.10E+3nMpH: 7.5Assay Description:The assay was carried out in binding mixtures of the bromodomain protein, 0-10 μM compounds and tetra-acetylated histone peptide (SGRGAC.KGGAC.K...
Ligand InfoPC cidPC sid
In DepthDetails US Patent