BDBM237526 US9393232, 2.51b
SMILES Cc1noc(C)c1-c1ccc2NC(=O)C(N3C[C@H](O)C[C@@H]3CO)(c2c1)c1ccccc1
InChI Key InChIKey=GTXKLIRENBGZEF-AHTUAUCYSA-N
Data  1 IC50
  Tab Delimited (TSV)   2D SDfile   Computed 3D by Vconf -m prep SDfile
Find this compound or compounds like it in BindingDB:
Activity Spreadsheet -- Enzyme Inhibition Constant Data from BindingDB
Found 1 hit for monomerid = 237526
TargetBromodomain-containing protein 4 [1-477](Homo sapiens (Human))
Beigene
US Patent
LigandPNGBDBM237526(US9393232, 2.51b)
Affinity DataIC50:  67nMpH: 7.5Assay Description:The assay was carried out in binding mixtures of the bromodomain protein, 0-10 μM compounds and tetra-acetylated histone peptide (SGRGAC.KGGAC.K...
Ligand InfoPC cidPC sid
In DepthDetails US Patent