BDBM237631 US9394263, 43
SMILES CN[C@@H](C)C(=O)N[C@H]1[C@H](C)Oc2ccc(cc2N(Cc2c(OC)ccc3cc(Br)ccc23)C1=O)C(F)(F)F
InChI Key InChIKey=OALZJUACHCHIBD-ISQRANHSSA-N
Data  2 IC50
  Tab Delimited (TSV)   2D SDfile   Computed 3D by Vconf -m prep SDfile
Find this compound or compounds like it in BindingDB:
Activity Spreadsheet -- Enzyme Inhibition Constant Data from BindingDB
Found 2 hits for monomerid = 237631
TargetE3 ubiquitin-protein ligase XIAP [241-356](Homo sapiens (Human))
F. Hoffmann-La Roche
US Patent
LigandPNGBDBM237631(US9394263, 43)
Affinity DataIC50: >5.48E+4nMpH: 7.5 T: 2°C. Assay description: Ten nanomolar of 6x Histidine-tagged BIR2 domain, corresponding to amino acids 124-240 of XIAP, or BIR3 domain, corresponding to amino acids 241-356 ...
Ligand InfoPC cidPC sid
In DepthDetails US Patent
TargetE3 ubiquitin-protein ligase XIAP [124-240](Artificial Sequence)
F. Hoffmann-La Roche
US Patent
LigandPNGBDBM237631(US9394263, 43)
Affinity DataIC50:  92nMpH: 7.5 T: 2°C. Assay description: Ten nanomolar of 6x Histidine-tagged BIR2 domain, corresponding to amino acids 124-240 of XIAP, or BIR3 domain, corresponding to amino acids 241-356 ...
Ligand InfoPC cidPC sid
In DepthDetails US Patent