BDBM23764 3-({4-[(4-docosylpiperazin-1-yl)carbonyl]phenyl}methyl)-4,5-dihydro-1,2,4-oxadiazol-5-one::PMS 1062 piperazine deriv., 26e
SMILES CCCCCCCCCCCCCCCCCCCCCCN1CCN(CC1)C(=O)c1ccc(Cc2nc(=O)o[nH]2)cc1
InChI Key InChIKey=ASANVOVJPUUIFV-UHFFFAOYSA-N
Data  2 IC50
  Tab Delimited (TSV)   2D SDfile   Computed 3D by Vconf -m prep SDfile
Find this compound or compounds like it in BindingDB:
Activity Spreadsheet -- Enzyme Inhibition Constant Data from BindingDB
Found 2 hits for monomerid = 23764
TargetPhospholipase A2, major isoenzyme(Sus scrofa (pig))
Universite Paris 7-Denis Diderot
LigandPNGBDBM23764(3-({4-[(4-docosylpiperazin-1-yl)carbonyl]phenyl}me...)
Affinity DataIC50: >1.00E+5nM. Assay description: PLA2 activity is by using the fluorescent phospholipid analogue as the substrate. The increase in fluorescence (ex @342 nm and em@388 nm) of the enzy...
In DepthDetails ArticlePubMed
TargetPhospholipase A2, membrane associated(Homo sapiens (Human))
Universite Paris 7-Denis Diderot
LigandPNGBDBM23764(3-({4-[(4-docosylpiperazin-1-yl)carbonyl]phenyl}me...)
Affinity DataIC50:  100nMpH: 7.5 T: 2°C. Assay description: PLA2 activity is by using the fluorescent phospholipid analogue, beta-pyC-10-PG as the substrate. The increase in fluorescence (ex @342 nm and em@388...
In DepthDetails ArticlePubMed