BDBM237667 US9394263, 80
SMILES CN[C@@H](C)C(=O)N[C@H]1[C@H](C)Oc2ccccc2N(Cc2cccc3n(ncc23)-c2ccc(cc2C#N)C(O)=O)C1=O
InChI Key InChIKey=UABHKXRZUPPGRI-VFUKXHBFSA-N
Data  2 IC50
  Tab Delimited (TSV)   2D SDfile   Computed 3D by Vconf -m prep SDfile
Find this compound or compounds like it in BindingDB:
Activity Spreadsheet -- Enzyme Inhibition Constant Data from BindingDB
Found 2 hits for monomerid = 237667
TargetE3 ubiquitin-protein ligase XIAP [241-356](Homo sapiens (Human))
F. Hoffmann-La Roche
US Patent
LigandPNGBDBM237667(US9394263, 80)
Affinity DataIC50: >5.48E+4nMpH: 7.5 T: 2°C. Assay description: Ten nanomolar of 6x Histidine-tagged BIR2 domain, corresponding to amino acids 124-240 of XIAP, or BIR3 domain, corresponding to amino acids 241-356 ...
Ligand InfoPC cidPC sid
In DepthDetails US Patent
TargetE3 ubiquitin-protein ligase XIAP [124-240](Artificial Sequence)
F. Hoffmann-La Roche
US Patent
LigandPNGBDBM237667(US9394263, 80)
Affinity DataIC50:  118nMpH: 7.5 T: 2°C. Assay description: Ten nanomolar of 6x Histidine-tagged BIR2 domain, corresponding to amino acids 124-240 of XIAP, or BIR3 domain, corresponding to amino acids 241-356 ...
Ligand InfoPC cidPC sid
In DepthDetails US Patent