BDBM237668 US9394263, 81
SMILES CCNC(=O)c1ccc(c(c1)C#N)-n1ncc2c(CN3c4ccccc4O[C@@H](C)[C@H](NC(=O)[C@H](C)NC)C3=O)cccc12
InChI Key InChIKey=OICHJWNMJNGMBK-SGHJWQDXSA-N
Data  2 IC50
  Tab Delimited (TSV)   2D SDfile   Computed 3D by Vconf -m prep SDfile
Find this compound or compounds like it in BindingDB:
Activity Spreadsheet -- Enzyme Inhibition Constant Data from BindingDB
Found 2 hits for monomerid = 237668
TargetE3 ubiquitin-protein ligase XIAP [241-356](Homo sapiens (Human))
F. Hoffmann-La Roche
US Patent
LigandPNGBDBM237668(US9394263, 81)
Affinity DataIC50: >5.48E+4nMpH: 7.5 T: 2°C. Assay description: Ten nanomolar of 6x Histidine-tagged BIR2 domain, corresponding to amino acids 124-240 of XIAP, or BIR3 domain, corresponding to amino acids 241-356 ...
Ligand InfoPC cidPC sid
In DepthDetails US Patent
TargetE3 ubiquitin-protein ligase XIAP [124-240](Artificial Sequence)
F. Hoffmann-La Roche
US Patent
LigandPNGBDBM237668(US9394263, 81)
Affinity DataIC50:  132nMpH: 7.5 T: 2°C. Assay description: Ten nanomolar of 6x Histidine-tagged BIR2 domain, corresponding to amino acids 124-240 of XIAP, or BIR3 domain, corresponding to amino acids 241-356 ...
Ligand InfoPC cidPC sid
In DepthDetails US Patent