BDBM238012 US9394285, 98
SMILES COc1ccc(c(F)c1)-c1cc2c(n[nH]c2cc1C)C(O)=O
InChI Key InChIKey=HEGUDUNJCNJEQS-UHFFFAOYSA-N
Data  1 EC50
  Tab Delimited (TSV)   2D SDfile   Computed 3D by Vconf -m prep SDfile
Find this compound or compounds like it in BindingDB:
Activity Spreadsheet -- Enzyme Inhibition Constant Data from BindingDB
Found 1 hit for monomerid = 238012
LigandPNGBDBM238012(US9394285, 98)
Affinity DataEC50:  1.05E+3nMpH: 7.5 T: 2°C. Assay description: The biochemical EC50 (half-maximal concentration required for full activation) of compounds for the activation of AMPK was evaluated by 33P-based ass...
Ligand InfoPC cidPC sid
In DepthDetails US Patent