BDBM238050 US9394285, 138
SMILES O[C@H]1C[C@@H](C1)c1ccc(cc1)-c1cc2c(c[nH]c2cc1Cl)C(O)=O
InChI Key
Data  1 EC50
  Tab Delimited (TSV)   2D SDfile   Computed 3D by Vconf -m prep SDfile
Find this compound or compounds like it in BindingDB:
Activity Spreadsheet -- Enzyme Inhibition Constant Data from BindingDB
Found 1 hit for monomerid = 238050
LigandPNGBDBM238050(US9394285, 138)
Affinity DataEC50:  40.4nMpH: 7.5 T: 2°C. Assay description: The biochemical EC50 (half-maximal concentration required for full activation) of compounds for the activation of AMPK was evaluated by 33P-based ass...
Ligand InfoPC cidPC sid
In DepthDetails US Patent