BDBM238053 US9394285, 142
SMILES OCC1(CCC1)c1ccc(cc1F)-c1cc2c(c[nH]c2cc1Cl)C(O)=O
InChI Key InChIKey=YQPXAFJKRPOUBJ-UHFFFAOYSA-N
Data  1 EC50
  Tab Delimited (TSV)   2D SDfile   Computed 3D by Vconf -m prep SDfile
Find this compound or compounds like it in BindingDB:
Activity Spreadsheet -- Enzyme Inhibition Constant Data from BindingDB
Found 1 hit for monomerid = 238053
LigandPNGBDBM238053(US9394285, 142)
Affinity DataEC50:  21.5nMpH: 7.5 T: 2°C. Assay description: The biochemical EC50 (half-maximal concentration required for full activation) of compounds for the activation of AMPK was evaluated by 33P-based ass...
Ligand InfoPC cidPC sid
In DepthDetails US Patent