BDBM238062 US9394285, 152::US9394285, 155
SMILES OC(=O)c1c[nH]c2cc(F)c(-c3ccc(cc3)[C@H]3CCCO3)c(F)c12
InChI Key
Data  1 EC50
  Tab Delimited (TSV)   2D SDfile   Computed 3D by Vconf -m prep SDfile
Find this compound or compounds like it in BindingDB:
Activity Spreadsheet -- Enzyme Inhibition Constant Data from BindingDB
Found 1 hit for monomerid = 238062
LigandPNGBDBM238062(US9394285, 152 | US9394285, 155)
Affinity DataEC50:  16.8nMpH: 7.5 T: 2°C. Assay description: The biochemical EC50 (half-maximal concentration required for full activation) of compounds for the activation of AMPK was evaluated by 33P-based ass...
Ligand InfoPC cidPC sid
In DepthDetails US Patent