BDBM238068 US9394285, 160
SMILES OC(=O)c1c[nH]c2cc(Cl)c(cc12)-c1ccc(OCc2ncccn2)cc1
InChI Key InChIKey=LEOQSHGHSAMRQW-UHFFFAOYSA-N
Data  1 EC50
  Tab Delimited (TSV)   2D SDfile   Computed 3D by Vconf -m prep SDfile
Find this compound or compounds like it in BindingDB:
Activity Spreadsheet -- Enzyme Inhibition Constant Data from BindingDB
Found 1 hit for monomerid = 238068
LigandPNGBDBM238068(US9394285, 160)
Affinity DataEC50:  17.3nMpH: 7.5 T: 2°C. Assay description: The biochemical EC50 (half-maximal concentration required for full activation) of compounds for the activation of AMPK was evaluated by 33P-based ass...
Ligand InfoPC cidPC sid
In DepthDetails US Patent