BDBM238198 US9402837, 2
SMILES CCCCCN1C[C@@H](O)[C@H](O)[C@@H](CO)C1
InChI Key InChIKey=HQRWMZVXYSGFQJ-GMTAPVOTSA-N
Data  1 KI  1 IC50
  Tab Delimited (TSV)   2D SDfile   Computed 3D by Vconf -m prep SDfile
Find this compound or compounds like it in BindingDB:
Activity Spreadsheet -- Enzyme Inhibition Constant Data from BindingDB
Found 1 hit for monomerid = 238198
TargetLysosomal acid glucosylceramidase(Homo sapiens (Human))
Amicus Therapeutics
US Patent
LigandPNGBDBM238198(US9402837, 2)
Affinity DataKi:  4.06E+5nM IC50:  9.80E+5nMpH: 4.5Assay Description:To 2.5 μl of supernatant (in 96-well plates) was added 17.5 μl reaction buffer (citrate phosphate buffer, pH 4.5, no Triton X-100), and 50 μ...
Ligand InfoPC cidPC sid
In DepthDetails US Patent