BDBM238221 US9403774, 20
SMILES CC1(C)Cc2c(cccc2-c2cc3ccccc3s2)C(N1C(=O)[C@H]1CC[C@H](CN)CC1)C(=O)Nc1ccc(cc1)C(O)=O
InChI Key InChIKey=REUAFFIPCDNPIC-SDTPFZHKSA-N
Data  1 KI
  Tab Delimited (TSV)   2D SDfile   Computed 3D by Vconf -m prep SDfile
Find this compound or compounds like it in BindingDB:
Activity Spreadsheet -- Enzyme Inhibition Constant Data from BindingDB
Found 1 hit for monomerid = 238221
TargetCoagulation factor XI(Homo sapiens (Human))
Bristol-Myers Squibb
US Patent
LigandPNGBDBM238221(US9403774, 20)
Affinity DataKi:  782nMpH: 7.4Assay Description:Factor XIa determinations were made in 50 mM HEPES buffer at pH 7.4 containing 145 mM NaCl, 5 mM KCl, and 0.1% PEG 8000 (polyethylene glycol; JT Bake...
Ligand InfoPC cidPC sid
In DepthDetails US Patent