BDBM238234 US9388210, 14a::US9388210, 6a
SMILES [H][C@@]12CC\C(=C\C#N)[C@@]1(C)CC(=O)[C@@]1([H])[C@@]2([H])CC[C@@]2([H])C[C@H](O)CC[C@]12C
InChI Key InChIKey=VFWOXQNFPHOBLO-FSHNTJAOSA-N
Data  2 IC50
  Tab Delimited (TSV)   2D SDfile   Computed 3D by Vconf -m prep SDfile
Find this compound or compounds like it in BindingDB:
Activity Spreadsheet -- Enzyme Inhibition Constant Data from BindingDB
Found 2 hits for monomerid = 238234
TargetGamma-aminobutyric acid receptor subunit alpha-1/beta-2/gamma-2(Rattus norvegicus (Rat))
Washington University
US Patent
LigandPNGBDBM238234(US9388210, 14a | US9388210, 6a)
Affinity DataIC50:  25nMpH: 7.4 T: 2°C. Assay description: Briefly, aliquots of membrane solution (0.5 mg/mL final protein concentration in assay) were incubated with 5 μM GABA, 2 nM [35S]TBPS (45−...
Ligand InfoPC cidPC sid
In DepthDetails US Patent
TargetGamma-aminobutyric acid receptor subunit alpha-1/beta-2/gamma-2(Rattus norvegicus (Rat))
Washington University
US Patent
LigandPNGBDBM238234(US9388210, 14a | US9388210, 6a)
Affinity DataIC50:  128nMpH: 7.4 T: 2°C. Assay description: Briefly, aliquots of membrane solution (0.5 mg/mL final protein concentration in assay) were incubated with 5 μM GABA, 2 nM [35S]TBPS (45−...
Ligand InfoPC cidPC sid
In DepthDetails US Patent