BDBM238249 US9388210, 5c
SMILES [H][C@@]12CC[C@H](CC#N)[C@@]1(C)CC(=O)[C@@]1([H])[C@@]2([H])CC[C@@]2([H])C[C@H](O)CC[C@]12C
InChI Key InChIKey=ZTXVGRBGXNTKSV-JACJHEDTSA-N
Data  1 IC50
  Tab Delimited (TSV)   2D SDfile   Computed 3D by Vconf -m prep SDfile
Find this compound or compounds like it in BindingDB:
Activity Spreadsheet -- Enzyme Inhibition Constant Data from BindingDB
Found 1 hit for monomerid = 238249
TargetGamma-aminobutyric acid receptor subunit alpha-1/beta-2/gamma-2(Rattus norvegicus (Rat))
Washington University
US Patent
LigandPNGBDBM238249(US9388210, 5c)
Affinity DataIC50:  1.02E+3nMpH: 7.4 T: 2°C. Assay description: Briefly, aliquots of membrane solution (0.5 mg/mL final protein concentration in assay) were incubated with 5 μM GABA, 2 nM [35S]TBPS (45−...
Ligand InfoPC cidPC sid
In DepthDetails US Patent