BDBM238714 US9394297, 378
SMILES Cc1nc2ccc(F)c(-c3cc4C(=O)NC5(CC5)c4[nH]3)c2nc1NC1(C)CC1
InChI Key InChIKey=IBNILFRNVFTCBR-UHFFFAOYSA-N
Data  2 IC50
  Tab Delimited (TSV)   2D SDfile   Computed 3D by Vconf -m prep SDfile
Find this compound or compounds like it in BindingDB:
Activity Spreadsheet -- Enzyme Inhibition Constant Data from BindingDB
Found 2 hits for monomerid = 238714
TargetSerine/threonine-protein kinase pim-2(Homo sapiens (Human))
Amgen
US Patent
LigandPNGBDBM238714(US9394297, 378)
Affinity DataIC50:  0.0354nMpH: 7.0 T: 2°C. Assay description: The assay for the determination of Pim activity is based on the formation of phosphorylated biotinylated-BAD peptide at the Serine 112 residue (S112)...
Ligand InfoPC cidPC sid
In DepthDetails US Patent
TargetSerine/threonine-protein kinase pim-1(Homo sapiens (Human))
Amgen
US Patent
LigandPNGBDBM238714(US9394297, 378)
Affinity DataIC50:  0.0295nMpH: 7.0 T: 2°C. Assay description: The assay for the determination of Pim activity is based on the formation of phosphorylated biotinylated-BAD peptide at the Serine 112 residue (S112)...
Ligand InfoPC cidPC sid
In DepthDetails US Patent